Reaction Details
TargetCannabinoid receptor 1
LigandBDBM50316526
Substrate/Competitorn/a
Meas. Tech.ChEMBL_630794 (CHEMBL1105736)
IC50 1.4±n/a nM
Citation Yan, LHuo, PDebenham, JSMadsen-Duggan, CBLao, JChen, RZXiao, JCShen, CPStribling, DSShearman, LPStrack, AMTsou, NBall, RGWang, JTong, XBateman, TJReddy, VBFong, TMHale, JJ Discovery of N-[(4R)-6-(4-chlorophenyl)-7-(2,4-dichlorophenyl)-2,2-dimethyl-3,4-dihydro-2H-pyrano[2,3-b]pyridin-4-yl]-5-methyl-1H-pyrazole-3-carboxamide (MK-5596) as a novel cannabinoid-1 receptor (CB1R) inverse agonist for the treatment of obesity. J Med Chem53:4028-37 (2010) 
 
Cannabinoid receptor 1
Name:Cannabinoid receptor 1
Type:G Protein-Coupled Receptor (GPCR)
Mol. Mass.:52868.96
Organism:Homo sapiens (Human)
Description:P21554
Residue:472
BDBM50316526
NameBDBM50316526
Synonyms:CHEMBL1097840 | N-[(4R)-6-(4-Chlorophenyl)-7-(2,4-dichlorophenyl)-2,2-dimethyl-3,4-dihydro-2H-pyrano[2,3-b]pyridine-4-yl]-1,4,5,6-tetrahydrocyclopenta[a]pyrazole-3-carboxamide
TypeSmall organic molecule
Emp. Form.C29H25Cl3N4O2
Mol. Mass.567.893
SMILESCC1(C)C[C@@H](NC(=O)c2[nH]nc3CCCc23)c2cc(-c3ccc(Cl)cc3)c(nc2O1)-c1ccc(Cl)cc1Cl