Reaction Details
TargetCannabinoid receptor 2
LigandBDBM50316517
Substrate/Competitorn/a
Meas. Tech.ChEMBL_630795 (CHEMBL1105737)
IC50 3400±n/a nM
Citation Yan, LHuo, PDebenham, JSMadsen-Duggan, CBLao, JChen, RZXiao, JCShen, CPStribling, DSShearman, LPStrack, AMTsou, NBall, RGWang, JTong, XBateman, TJReddy, VBFong, TMHale, JJ Discovery of N-[(4R)-6-(4-chlorophenyl)-7-(2,4-dichlorophenyl)-2,2-dimethyl-3,4-dihydro-2H-pyrano[2,3-b]pyridin-4-yl]-5-methyl-1H-pyrazole-3-carboxamide (MK-5596) as a novel cannabinoid-1 receptor (CB1R) inverse agonist for the treatment of obesity. J Med Chem53:4028-37 (2010) 
 
Cannabinoid receptor 2
Name:Cannabinoid receptor 2
Type:G Protein-Coupled Receptor (GPCR)
Mol. Mass.:39690.94
Organism:Homo sapiens (Human)
Description:P34972
Residue:360
BDBM50316517
NameBDBM50316517
Synonyms:CHEMBL1169572 | N-[6-(4-Chlorophenyl)-7-(2,4-dichlorophenyl)-2,2-dimethyl-3,4-dihydro-2H-pyrano[2,3-b]pyridine-4-yl]-3,3,3-trifluoro-2-hydroxypropanamide
TypeSmall organic molecule
Emp. Form.C26H23Cl2F3N2O3
Mol. Mass.539.374
SMILESCc1cc(Cl)ccc1-c1nc2OC(C)(C)CC(NC(=O)C(O)C(F)(F)F)c2cc1-c1ccc(Cl)cc1