Reaction Details
TargetPotassium voltage-gated channel subfamily H member 2
LigandBDBM50316531
Substrate/Competitorn/a
Meas. Tech.ChEMBL_630798 (CHEMBL1105740)
IC50 4600±n/a nM
Citation Yan, LHuo, PDebenham, JSMadsen-Duggan, CBLao, JChen, RZXiao, JCShen, CPStribling, DSShearman, LPStrack, AMTsou, NBall, RGWang, JTong, XBateman, TJReddy, VBFong, TMHale, JJ Discovery of N-[(4R)-6-(4-chlorophenyl)-7-(2,4-dichlorophenyl)-2,2-dimethyl-3,4-dihydro-2H-pyrano[2,3-b]pyridin-4-yl]-5-methyl-1H-pyrazole-3-carboxamide (MK-5596) as a novel cannabinoid-1 receptor (CB1R) inverse agonist for the treatment of obesity. J Med Chem53:4028-37 (2010) 
 
Potassium voltage-gated channel subfamily H member 2
Name:Potassium voltage-gated channel subfamily H member 2
Type:Multi-pass membrane protein
Mol. Mass.:126672.65
Organism:Homo sapiens (Human)
Description:Q12809
Residue:1159
BDBM50316531
NameBDBM50316531
Synonyms:CHEMBL1095553 | N-[(4R)-6-(4-Chlorophenyl)-7-(2,4-dichlorophenyl)-2,2-dimethyl-3,4-dihydro-2H-pyrano[2,3-b]pyridine-4-yl]-1H-indazole-3-carboxamide
TypeSmall organic molecule
Emp. Form.C30H23Cl3N4O2
Mol. Mass.577.888
SMILESCC1(C)C[C@@H](NC(=O)c2n[nH]c3ccccc23)c2cc(-c3ccc(Cl)cc3)c(nc2O1)-c1ccc(Cl)cc1Cl