Reaction Details
TargetCannabinoid receptor 2
LigandBDBM50314108
Substrate/Competitorn/a
Meas. Tech.ChEMBL_630800 (CHEMBL1105742)
IC50 5400±n/a nM
Citation Yan, LHuo, PDebenham, JSMadsen-Duggan, CBLao, JChen, RZXiao, JCShen, CPStribling, DSShearman, LPStrack, AMTsou, NBall, RGWang, JTong, XBateman, TJReddy, VBFong, TMHale, JJ Discovery of N-[(4R)-6-(4-chlorophenyl)-7-(2,4-dichlorophenyl)-2,2-dimethyl-3,4-dihydro-2H-pyrano[2,3-b]pyridin-4-yl]-5-methyl-1H-pyrazole-3-carboxamide (MK-5596) as a novel cannabinoid-1 receptor (CB1R) inverse agonist for the treatment of obesity. J Med Chem53:4028-37 (2010) 
 
Cannabinoid receptor 2
Name:Cannabinoid receptor 2
Type:G Protein-Coupled Receptor (GPCR)
Mol. Mass.:39690.94
Organism:Homo sapiens (Human)
Description:P34972
Residue:360
BDBM50314108
NameBDBM50314108
Synonyms:CHEMBL1092169 | N-(6-(2-chlorophenyl)-5-(4-chlorophenyl)-2-(2-hydroxy-2-methylpropanoyl)furo[2,3-b]pyridin-3-yl)-2-hydroxyacetamide
TypeSmall organic molecule
Emp. Form.C25H20Cl2N2O5
Mol. Mass.499.343
SMILESCC(C)(O)C(=O)c1oc2nc(-c3ccccc3Cl)c(cc2c1NC(=O)CO)-c1ccc(Cl)cc1