Reaction Details
TargetDynamin-2
LigandBDBM50316543
Substrate/Competitorn/a
Meas. Tech.ChEMBL_631207 (CHEMBL1110056)
IC50 74600±n/a nM
Citation Hill, TAMariana, AGordon, CPOdell, LRRobertson, MJMcGeachie, ABChau, NDaniel, JAGorgani, NNRobinson, PJMcCluskey, A Iminochromene inhibitors of dynamins I and II GTPase activity and endocytosis. J Med Chem53:4094-102 (2010) 
 
Dynamin-2
Name:Dynamin-2
Type:PROTEIN
Mol. Mass.:98071.19
Organism:Homo sapiens (Human)
Description:ChEMBL_934670
Residue:870
BDBM50316543
NameBDBM50316543
Synonyms:CHEMBL1094197 | N,N'-(Propane-1,3-diyl)bis(6,7-dihydroxy-2-imino-2H-chromene-3-carboxamide)
TypeSmall organic molecule
Emp. Form.C23H20N4O8
Mol. Mass.480.4269
SMILESOc1cc2cc(C(=O)NCCCNC(=O)c3cc4cc(O)c(O)cc4oc3=N)c(=N)oc2cc1O