Reaction Details
TargetDelta-type opioid receptor
LigandBDBM50316549
Substrate/Competitorn/a
Meas. Tech.ChEMBL_631250 (CHEMBL1113830)
IC50 700±n/a nM
Citation Carroll, ARArumugan, TRedburn, JNgo, AGuymer, GPForster, PIQuinn, RJ Hasubanan alkaloids with delta-opioid binding affinity from the aerial parts of Stephania japonica. J Nat Prod73:988-91 (2010) 
 
Delta-type opioid receptor
Name:Delta-type opioid receptor
Type:G Protein-Coupled Receptor (GPCR)
Mol. Mass.:40382.98
Organism:Homo sapiens (Human)
Description:Competition binding assays were carried out using membrane preparations from transfected HN9.10 cells that constitutively expressed the delta opioid receptor.
Residue:372
BDBM50316549
NameBDBM50316549
Synonyms:CHEMBL1097805 | longanine
TypeSmall organic molecule
Emp. Form.C19H25NO6
Mol. Mass.363.4049
SMILESCO[C@H]1[C@@H](O)C[C@]23CCN(C)[C@@]22C[C@H](O[C@]12O)c1ccc(OC)c(O)c31