Reaction Details
TargetDelta-type opioid receptor
LigandBDBM50316547
Substrate/Competitorn/a
Meas. Tech.ChEMBL_631250 (CHEMBL1113830)
IC50 5100±n/a nM
Citation Carroll, ARArumugan, TRedburn, JNgo, AGuymer, GPForster, PIQuinn, RJ Hasubanan alkaloids with delta-opioid binding affinity from the aerial parts of Stephania japonica. J Nat Prod73:988-91 (2010) 
 
Delta-type opioid receptor
Name:Delta-type opioid receptor
Type:G Protein-Coupled Receptor (GPCR)
Mol. Mass.:40382.98
Organism:Homo sapiens (Human)
Description:Competition binding assays were carried out using membrane preparations from transfected HN9.10 cells that constitutively expressed the delta opioid receptor.
Residue:372
BDBM50316547
NameBDBM50316547
Synonyms:6-cinnamoylhernandine | CHEMBL1097804
TypeSmall organic molecule
Emp. Form.C29H31NO8
Mol. Mass.521.5583
SMILESCO[C@H]1[C@H](C[C@]23CC(=O)N(C)[C@@]22C[C@H](O[C@]12OC)c1ccc(OC)c(O)c31)OC(=O)\C=C\c1ccccc1