Reaction Details
Target6,7-dimethyl-8-ribityllumazine synthase
LigandBDBM50316574
Substrate/Competitorn/a
Meas. Tech.ChEMBL_631472 (CHEMBL1114706)
Ki 70000±n/a nM
Citation Talukdar, AMorgunova, EDuan, JMeining, WFoloppe, NNilsson, LBacher, AIllarionov, BFischer, MLadenstein, RCushman, M Virtual screening, selection and development of a benzindolone structural scaffold for inhibition of lumazine synthase. Bioorg Med Chem18:3518-34 (2010) 
 
6,7-dimethyl-8-ribityllumazine synthase
Name:6,7-dimethyl-8-ribityllumazine synthase
Type:PROTEIN
Mol. Mass.:16367.39
Organism:Mycobacterium tuberculosis
Description:ChEMBL_631469
Residue:160
BDBM50316574
NameBDBM50316574
Synonyms:2-(2-oxo-1,2-dihydrobenzo[cd]indole-6-sulfonamido)aceticacid cid_1103357
TypeSmall organic molecule
Emp. Form.C13H10N2O5S
Mol. Mass.306.294
SMILESOC(=O)CNS(=O)(=O)c1ccc2NC(=O)c3cccc1c23