Reaction Details
Target6,7-dimethyl-8-ribityllumazine synthase
LigandBDBM50316577
Substrate/Competitorn/a
Meas. Tech.ChEMBL_631473 (CHEMBL1114707)
Ki 572000±n/a nM
Citation Talukdar, AMorgunova, EDuan, JMeining, WFoloppe, NNilsson, LBacher, AIllarionov, BFischer, MLadenstein, RCushman, M Virtual screening, selection and development of a benzindolone structural scaffold for inhibition of lumazine synthase. Bioorg Med Chem18:3518-34 (2010) 
 
6,7-dimethyl-8-ribityllumazine synthase
Name:6,7-dimethyl-8-ribityllumazine synthase
Type:PROTEIN
Mol. Mass.:16367.39
Organism:Mycobacterium tuberculosis
Description:ChEMBL_631469
Residue:160
BDBM50316577
NameBDBM50316577
Synonyms:4-(2-Oxo-1,2-dihydrobenzo[cd]indole-6-sulfonamido)-butyldihydrogen phosphate | CHEMBL1097477
TypeSmall organic molecule
Emp. Form.C15H17N2O7PS
Mol. Mass.400.343
SMILESOP(O)(=O)OCCCCNS(=O)(=O)c1ccc2NC(=O)c3cccc1c23