Reaction Details
Target6,7-dimethyl-8-ribityllumazine synthase
LigandBDBM50316580
Substrate/Competitorn/a
Meas. Tech.ChEMBL_631469 (CHEMBL1113888)
Ki 18000±n/a nM
Citation Talukdar, AMorgunova, EDuan, JMeining, WFoloppe, NNilsson, LBacher, AIllarionov, BFischer, MLadenstein, RCushman, M Virtual screening, selection and development of a benzindolone structural scaffold for inhibition of lumazine synthase. Bioorg Med Chem18:3518-34 (2010) 
 
6,7-dimethyl-8-ribityllumazine synthase
Name:6,7-dimethyl-8-ribityllumazine synthase
Type:PROTEIN
Mol. Mass.:16367.39
Organism:Mycobacterium tuberculosis
Description:ChEMBL_631469
Residue:160
BDBM50316580
NameBDBM50316580
Synonyms:6-(2-oxo-1,2-dihydrobenzo[cd]indole-6-sulfonamido)hexyldihydrogen phosphate | CHEMBL1095867
TypeSmall organic molecule
Emp. Form.C17H21N2O7PS
Mol. Mass.428.397
SMILESOP(O)(=O)OCCCCCCNS(=O)(=O)c1ccc2NC(=O)c3cccc1c23