Reaction Details
TargetArginase-1
LigandBDBM50316608
Substrate/Competitorn/a
Meas. Tech.ChEMBL_631783 (CHEMBL1108176)
Ki 3600000±n/a nM
Citation Ilies, MDi Costanzo, LNorth, MLScott, JAChristianson, DW 2-aminoimidazole amino acids as inhibitors of the binuclear manganese metalloenzyme human arginase I. J Med Chem53:4266-76 (2010) 
 
Arginase-1
Name:Arginase-1
Type:PROTEIN
Mol. Mass.:34737.53
Organism:Homo sapiens (Human)
Description:ChEMBL_978893
Residue:322
BDBM50316608
NameBDBM50316608
Synonyms:1H-Imidazol-2-yl-ammonium 1H-imidazol-2-amine CHEMBL2392115 | CHEMBL291627
TypeSmall organic molecule
Emp. Form.C3H5N3
Mol. Mass.83.0919
SMILESNc1ncc[nH]1