Reaction Details
TargetNitric oxide synthase, inducible
LigandBDBM50316606
Substrate/Competitorn/a
Meas. Tech.ChEMBL_631957 (CHEMBL1104713)
IC50 65000±n/a nM
Citation Ilies, MDi Costanzo, LNorth, MLScott, JAChristianson, DW 2-aminoimidazole amino acids as inhibitors of the binuclear manganese metalloenzyme human arginase I. J Med Chem53:4266-76 (2010) 
 
Nitric oxide synthase, inducible
Name:Nitric oxide synthase, inducible
Type:Enzyme
Mol. Mass.:130595.79
Organism:Mus musculus (mouse)
Description:Recombinant enzyme overexpressed in E. coli.
Residue:1144
BDBM50316606
NameBDBM50316606
Synonyms:(2S)-2-amino-4-(2-amino-1H-imidazol-5-yl)butanoic acid CHEMBL1099168
TypeSmall organic molecule
Emp. Form.C7H12N4O2
Mol. Mass.184.1958
SMILESN[C@@H](CCc1cnc(N)[nH]1)C(O)=O