Reaction Details
TargetNitric oxide synthase, inducible
LigandBDBM50316603
Substrate/Competitorn/a
Meas. Tech.ChEMBL_631957 (CHEMBL1104713)
IC50 135000±n/a nM
Citation Ilies, MDi Costanzo, LNorth, MLScott, JAChristianson, DW 2-aminoimidazole amino acids as inhibitors of the binuclear manganese metalloenzyme human arginase I. J Med Chem53:4266-76 (2010) 
 
Nitric oxide synthase, inducible
Name:Nitric oxide synthase, inducible
Type:Enzyme
Mol. Mass.:130595.79
Organism:Mus musculus (mouse)
Description:Recombinant enzyme overexpressed in E. coli.
Residue:1144
BDBM50316603
NameBDBM50316603
Synonyms:2-(S)-amino-5-(2-aminoimidazol-1-yl)pentanoic acid | CHEMBL1099169
TypeSmall organic molecule
Emp. Form.C8H14N4O2
Mol. Mass.198.2224
SMILESN[C@@H](CCCn1ccnc1N)C(O)=O