Reaction Details
Target5-hydroxytryptamine receptor 1A
LigandBDBM50316679
Substrate/Competitorn/a
Meas. Tech.ChEMBL_632233 (CHEMBL1110095)
Ki 0.79±n/a nM
Citation Childers, WEHavran, LMAsselin, MBicksler, JJChong, DCGrosu, GTShen, ZAbou-Gharbia, MABach, ACHarrison, BLKagan, NKleintop, TMagolda, RMarathias, VRobichaud, AJSabb, ALZhang, MYAndree, THAschmies, SHBeyer, CComery, TADay, MGrauer, SMHughes, ZARosenzweig-Lipson, SPlatt, BPulicicchio, CSmith, DESukoff-Rizzo, SJSullivan, KMAdedoyin, AHuselton, CHirst, WD The synthesis and biological evaluation of quinolyl-piperazinyl piperidines as potent serotonin 5-HT1A antagonists. J Med Chem53:4066-84 (2010) 
 
5-hydroxytryptamine receptor 1A
Name:5-hydroxytryptamine receptor 1A
Type:n/a
Mol. Mass.:46122.49
Organism:Homo sapiens (Human)
Description:n/a
Residue:422
BDBM50316679
NameBDBM50316679
Synonyms:3-Fluoro-8-{4-[4-(6-methoxyquinolin-8-yl)piperazin-1-yl]piperidin-1-yl}Quinoline | CHEMBL1098483
TypeSmall organic molecule
Emp. Form.C28H30FN5O
Mol. Mass.471.5691
SMILESCOc1cc(N2CCN(CC2)C2CCN(CC2)c2cccc3cc(F)cnc23)c2ncccc2c1