Reaction Details
Target5-hydroxytryptamine receptor 1A
LigandBDBM50316681
Substrate/Competitorn/a
Meas. Tech.ChEMBL_632233 (CHEMBL1110095)
Ki 2±n/a nM
Citation Childers, WEHavran, LMAsselin, MBicksler, JJChong, DCGrosu, GTShen, ZAbou-Gharbia, MABach, ACHarrison, BLKagan, NKleintop, TMagolda, RMarathias, VRobichaud, AJSabb, ALZhang, MYAndree, THAschmies, SHBeyer, CComery, TADay, MGrauer, SMHughes, ZARosenzweig-Lipson, SPlatt, BPulicicchio, CSmith, DESukoff-Rizzo, SJSullivan, KMAdedoyin, AHuselton, CHirst, WD The synthesis and biological evaluation of quinolyl-piperazinyl piperidines as potent serotonin 5-HT1A antagonists. J Med Chem53:4066-84 (2010) 
 
5-hydroxytryptamine receptor 1A
Name:5-hydroxytryptamine receptor 1A
Type:n/a
Mol. Mass.:46122.49
Organism:Homo sapiens (Human)
Description:n/a
Residue:422
BDBM50316681
NameBDBM50316681
Synonyms:5-Fluoro-4-methoxy-8-{4-[4-(6-methoxyquinolin-8-yl)piperazin-1-yl]piperidin-1-yl}-2-(trifluoromethyl)quinoline | CHEMBL1096671
TypeSmall organic molecule
Emp. Form.C30H31F4N5O2
Mol. Mass.569.5931
SMILESCOc1cc(N2CCN(CC2)C2CCN(CC2)c2ccc(F)c3c(OC)cc(nc23)C(F)(F)F)c2ncccc2c1