Reaction Details
TargetSphingosine 1-phosphate receptor 1
LigandBDBM50316768
Substrate/Competitorn/a
Meas. Tech.ChEMBL_632481 (CHEMBL1108345)
EC50 12±n/a nM
Citation Bolli, MHAbele, SBinkert, CBravo, RBuchmann, SBur, DGatfield, JHess, PKohl, CMangold, CMathys, BMenyhart, KMüller, CNayler, OScherz, MSchmidt, GSippel, VSteiner, BStrasser, DTreiber, AWeller, T 2-imino-thiazolidin-4-one derivatives as potent, orally active S1P1 receptor agonists. J Med Chem53:4198-211 (2010) 
 
Sphingosine 1-phosphate receptor 1
Name:Sphingosine 1-phosphate receptor 1
Type:Enzyme
Mol. Mass.:42836.02
Organism:Homo sapiens (Human)
Description:P21453
Residue:382
BDBM50316768
NameBDBM50316768
Synonyms:(Z,Z)-5-[3-Chloro-4-((2S)-2,3-dihydroxy-propoxy)-benzylidene]-2-propylimino-3-otolyl-thiazolidin-4-one | CHEMBL1096146
TypeSmall organic molecule
Emp. Form.C23H25ClN2O4S
Mol. Mass.460.974
SMILESCCC\N=C1/S\C(=C/c2ccc(OC[C@H](O)CO)c(Cl)c2)C(=O)N1c1ccccc1C