Reaction Details
TargetSphingosine 1-phosphate receptor 2
LigandBDBM50316769
Substrate/Competitorn/a
Meas. Tech.ChEMBL_632513 (CHEMBL1111161)
IC50>10000±n/a nM
Citation Bolli, MHAbele, SBinkert, CBravo, RBuchmann, SBur, DGatfield, JHess, PKohl, CMangold, CMathys, BMenyhart, KMüller, CNayler, OScherz, MSchmidt, GSippel, VSteiner, BStrasser, DTreiber, AWeller, T 2-imino-thiazolidin-4-one derivatives as potent, orally active S1P1 receptor agonists. J Med Chem53:4198-211 (2010) 
 
Sphingosine 1-phosphate receptor 2
Name:Sphingosine 1-phosphate receptor 2
Type:G Protein-Coupled Receptor (GPCR)
Mol. Mass.:38883.16
Organism:Homo sapiens (Human)
Description:Membranes isolated from S1P2-transfected CHO cells were used in ligand binding assay.
Residue:353
BDBM50316769
NameBDBM50316769
Synonyms:(Z,Z)-5-[3-Chloro-4-((2R)-2,3-dihydroxy-propoxy)-benzylidene]-2-propylimino-3-o-tolyl-thiazolidin-4-one | CHEMBL1095833
TypeSmall organic molecule
Emp. Form.C23H25ClN2O4S
Mol. Mass.460.974
SMILESCCC\N=C1/S\C(=C/c2ccc(OC[C@@H](O)CO)c(Cl)c2)C(=O)N1c1ccccc1C