Reaction Details
TargetSphingosine 1-phosphate receptor 3
LigandBDBM50316717
Substrate/Competitorn/a
Meas. Tech.ChEMBL_632482 (CHEMBL1108346)
EC50 212±n/a nM
Citation Bolli, MHAbele, SBinkert, CBravo, RBuchmann, SBur, DGatfield, JHess, PKohl, CMangold, CMathys, BMenyhart, KMüller, CNayler, OScherz, MSchmidt, GSippel, VSteiner, BStrasser, DTreiber, AWeller, T 2-imino-thiazolidin-4-one derivatives as potent, orally active S1P1 receptor agonists. J Med Chem53:4198-211 (2010) 
 
Sphingosine 1-phosphate receptor 3
Name:Sphingosine 1-phosphate receptor 3
Type:G Protein-Coupled Receptor (GPCR)
Mol. Mass.:42278.13
Organism:Homo sapiens (Human)
Description:Q99500
Residue:378
BDBM50316717
NameBDBM50316717
Synonyms:(Z,Z)-5-(3-Hydroxy-4-methoxy-benzylidene)-2-isopropylimino-3-phenyl-thiazolidin-4-one | CHEMBL1098772
TypeSmall organic molecule
Emp. Form.C20H20N2O3S
Mol. Mass.368.449
SMILESCOc1ccc(\C=C2/S\C(=N/C(C)C)N(C2=O)c2ccccc2)cc1O