Reaction Details
TargetSphingosine 1-phosphate receptor 3
LigandBDBM50316722
Substrate/Competitorn/a
Meas. Tech.ChEMBL_632482 (CHEMBL1108346)
EC50 1385±n/a nM
Citation Bolli, MHAbele, SBinkert, CBravo, RBuchmann, SBur, DGatfield, JHess, PKohl, CMangold, CMathys, BMenyhart, KMüller, CNayler, OScherz, MSchmidt, GSippel, VSteiner, BStrasser, DTreiber, AWeller, T 2-imino-thiazolidin-4-one derivatives as potent, orally active S1P1 receptor agonists. J Med Chem53:4198-211 (2010) 
 
Sphingosine 1-phosphate receptor 3
Name:Sphingosine 1-phosphate receptor 3
Type:G Protein-Coupled Receptor (GPCR)
Mol. Mass.:42278.13
Organism:Homo sapiens (Human)
Description:Q99500
Residue:378
BDBM50316722
NameBDBM50316722
Synonyms:(Z,Z)-5-(3,4-Dimethoxy-benzylidene)-2-isopropylimino-3-phenyl-thiazolidin-4-one | CHEMBL1098202
TypeSmall organic molecule
Emp. Form.C21H22N2O3S
Mol. Mass.382.476
SMILESCOc1ccc(\C=C2/S\C(=N/C(C)C)N(C2=O)c2ccccc2)cc1OC