Reaction Details
TargetSphingosine 1-phosphate receptor 3
LigandBDBM50316724
Substrate/Competitorn/a
Meas. Tech.ChEMBL_632482 (CHEMBL1108346)
EC50 335±n/a nM
Citation Bolli, MHAbele, SBinkert, CBravo, RBuchmann, SBur, DGatfield, JHess, PKohl, CMangold, CMathys, BMenyhart, KMüller, CNayler, OScherz, MSchmidt, GSippel, VSteiner, BStrasser, DTreiber, AWeller, T 2-imino-thiazolidin-4-one derivatives as potent, orally active S1P1 receptor agonists. J Med Chem53:4198-211 (2010) 
 
Sphingosine 1-phosphate receptor 3
Name:Sphingosine 1-phosphate receptor 3
Type:G Protein-Coupled Receptor (GPCR)
Mol. Mass.:42278.13
Organism:Homo sapiens (Human)
Description:Q99500
Residue:378
BDBM50316724
NameBDBM50316724
Synonyms:(Z,Z)-5-(4-Hydroxy-3-methoxy-benzylidene)-2-isopropylimino-3-phenyl-thiazolidin-4-one | CHEMBL1098200
TypeSmall organic molecule
Emp. Form.C20H20N2O3S
Mol. Mass.368.449
SMILESCOc1cc(\C=C2/S\C(=N/C(C)C)N(C2=O)c2ccccc2)ccc1O