Reaction Details
TargetSphingosine 1-phosphate receptor 3
LigandBDBM50316732
Substrate/Competitorn/a
Meas. Tech.ChEMBL_632482 (CHEMBL1108346)
EC50 228±n/a nM
Citation Bolli, MHAbele, SBinkert, CBravo, RBuchmann, SBur, DGatfield, JHess, PKohl, CMangold, CMathys, BMenyhart, KMüller, CNayler, OScherz, MSchmidt, GSippel, VSteiner, BStrasser, DTreiber, AWeller, T 2-imino-thiazolidin-4-one derivatives as potent, orally active S1P1 receptor agonists. J Med Chem53:4198-211 (2010) 
 
Sphingosine 1-phosphate receptor 3
Name:Sphingosine 1-phosphate receptor 3
Type:G Protein-Coupled Receptor (GPCR)
Mol. Mass.:42278.13
Organism:Homo sapiens (Human)
Description:Q99500
Residue:378
BDBM50316732
NameBDBM50316732
Synonyms:(Z,Z)-5-(3-Chloro-4-hydroxy-benzylidene)-2-isopropylimino-3-pyridin-3-ylthiazolidin-4-one | CHEMBL1094247
TypeSmall organic molecule
Emp. Form.C18H16ClN3O2S
Mol. Mass.373.857
SMILESCC(C)\N=C1/S\C(=C/c2ccc(O)c(Cl)c2)C(=O)N1c1cccnc1