Reaction Details
TargetSphingosine 1-phosphate receptor 3
LigandBDBM50316733
Substrate/Competitorn/a
Meas. Tech.ChEMBL_632482 (CHEMBL1108346)
EC50 525±n/a nM
Citation Bolli, MHAbele, SBinkert, CBravo, RBuchmann, SBur, DGatfield, JHess, PKohl, CMangold, CMathys, BMenyhart, KMüller, CNayler, OScherz, MSchmidt, GSippel, VSteiner, BStrasser, DTreiber, AWeller, T 2-imino-thiazolidin-4-one derivatives as potent, orally active S1P1 receptor agonists. J Med Chem53:4198-211 (2010) 
 
Sphingosine 1-phosphate receptor 3
Name:Sphingosine 1-phosphate receptor 3
Type:G Protein-Coupled Receptor (GPCR)
Mol. Mass.:42278.13
Organism:Homo sapiens (Human)
Description:Q99500
Residue:378
BDBM50316733
NameBDBM50316733
Synonyms:(Z,Z)-5-(3-Chloro-4-hydroxy-benzylidene)-3-(2,4-dimethoxy-phenyl)-2-isopropylimino-thiazolidin-4-one | CHEMBL1094246
TypeSmall organic molecule
Emp. Form.C21H21ClN2O4S
Mol. Mass.432.92
SMILESCOc1ccc(N2\C(S\C(=C/c3ccc(O)c(Cl)c3)C2=O)=N\C(C)C)c(OC)c1