Reaction Details
TargetVascular endothelial growth factor receptor 3
LigandBDBM50316788
Substrate/Competitorn/a
Meas. Tech.ChEMBL_632819 (CHEMBL1111033)
IC50 2190±n/a nM
Citation Büttner, ACottin, TXu, JTzagkaroulaki, LGiannis, A Serotonin derivatives as a new class of non-ATP-competitive receptor tyrosine kinase inhibitors. Bioorg Med Chem18:3387-402 (2010) 
 
Vascular endothelial growth factor receptor 3
Name:Vascular endothelial growth factor receptor 3
Type:Protein
Mol. Mass.:152749.58
Organism:Homo sapiens (Human)
Description:P35916-2
Residue:1363
BDBM50316788
NameBDBM50316788
Synonyms:4-(2-(3-amino-9-(5-phenylpentyl)-2,3,4,4a,9,9a-hexahydro-1H-carbazol-6-yloxy)ethyl)phenol hydrochloride | CHEMBL1098120
TypeSmall organic molecule
Emp. Form.C31H36N2O2
Mol. Mass.468.6297
SMILESNC1CCc2c(C1)c1cc(OCCc3ccc(O)cc3)ccc1n2CCCCCc1ccccc1