Reaction Details
TargetVascular endothelial growth factor receptor 3
LigandBDBM50316783
Substrate/Competitorn/a
Meas. Tech.ChEMBL_632807 (CHEMBL1105618)
IC50 2220±n/a nM
Citation Büttner, ACottin, TXu, JTzagkaroulaki, LGiannis, A Serotonin derivatives as a new class of non-ATP-competitive receptor tyrosine kinase inhibitors. Bioorg Med Chem18:3387-402 (2010) 
 
Vascular endothelial growth factor receptor 3
Name:Vascular endothelial growth factor receptor 3
Type:Protein
Mol. Mass.:152749.58
Organism:Homo sapiens (Human)
Description:P35916-2
Residue:1363
BDBM50316783
NameBDBM50316783
Synonyms:4-(2-(3-Amino-9-(5-(pyridine-2-yl)pentyl)-2,3,4,9-tetrahydro-1H-tetrahydrocarbazole-6-yloxy)ethyl)phenol dihydrochloride | CHEMBL3216699
TypeSmall organic molecule
Emp. Form.C30H37Cl2N3O2
Mol. Mass.542.54
SMILESCl.Cl.NC1CCc2c(C1)c1cc(OCCc3ccc(O)cc3)ccc1n2CCCCCc1ccccn1