Reaction Details
TargetVascular endothelial growth factor receptor 3
LigandBDBM50316781
Substrate/Competitorn/a
Meas. Tech.ChEMBL_632807 (CHEMBL1105618)
IC50 1810±n/a nM
Citation Büttner, ACottin, TXu, JTzagkaroulaki, LGiannis, A Serotonin derivatives as a new class of non-ATP-competitive receptor tyrosine kinase inhibitors. Bioorg Med Chem18:3387-402 (2010) 
 
Vascular endothelial growth factor receptor 3
Name:Vascular endothelial growth factor receptor 3
Type:Protein
Mol. Mass.:152749.58
Organism:Homo sapiens (Human)
Description:P35916-2
Residue:1363
BDBM50316781
NameBDBM50316781
Synonyms:4-(2-(3-Amino-9-(5-(4-methoxyphenyl)pentyl)-2,3,4,9-tetrahydro-1H-tetrahydrocarbazole-6-yloxy)ethyl)phenol hydrochloride | CHEMBL1094492
TypeSmall organic molecule
Emp. Form.C32H38N2O3
Mol. Mass.498.6557
SMILESCOc1ccc(CCCCCn2c3CCC(N)Cc3c3cc(OCCc4ccc(O)cc4)ccc23)cc1