Reaction Details
TargetBeta-secretase 1
LigandBDBM50316862
Substrate/Competitorn/a
Meas. Tech.ChEMBL_629616 (CHEMBL1121185)
IC50 3810±n/a nM
Citation Niu, YWang, YZou, XYang, XMa, CLü, YZhou, BYuan, YDu, GXu, P Synthesis and preliminary evaluation of peptidomimetic inhibitors of human beta-secretase. Eur J Med Chem45:2089-94 (2010) 
 
Beta-secretase 1
Name:Beta-secretase 1
Type:Protein
Mol. Mass.:55755.10
Organism:Homo sapiens (Human)
Description:P56817
Residue:501
BDBM50316862
NameBDBM50316862
Synonyms:CHEMBL1099023 | N-((S)-1-((4S,5S,7R)-5-hydroxy-8-(isobutylamino)-2,7-dimethyl-8-oxooctan-4-ylamino)-3-(4-nitrophenyl)-1-oxopropan-2-yl)-3,4-dimethoxybenzamide
TypeSmall organic molecule
Emp. Form.C32H46N4O8
Mol. Mass.614.7296
SMILESCOc1ccc(cc1OC)C(=O)N[C@@H](Cc1ccc(cc1)[N+]([O-])=O)C(=O)N[C@@H](CC(C)C)[C@@H](O)C[C@@H](C)C(=O)NCC(C)C