Reaction Details
TargetBeta-secretase 1
LigandBDBM50316861
Substrate/Competitorn/a
Meas. Tech.ChEMBL_629616 (CHEMBL1121185)
IC50 2640±n/a nM
Citation Niu, YWang, YZou, XYang, XMa, CLü, YZhou, BYuan, YDu, GXu, P Synthesis and preliminary evaluation of peptidomimetic inhibitors of human beta-secretase. Eur J Med Chem45:2089-94 (2010) 
 
Beta-secretase 1
Name:Beta-secretase 1
Type:Protein
Mol. Mass.:55755.10
Organism:Homo sapiens (Human)
Description:P56817
Residue:501
BDBM50316861
NameBDBM50316861
Synonyms:CHEMBL1099022 | N-((S)-1-((4S,5S,7R)-5-hydroxy-8-(isobutylamino)-2,7-dimethyl-8-oxooctan-4-ylamino)-3-(4-nitrophenyl)-1-oxopropan-2-yl)-4-nitrobenzamide
TypeSmall organic molecule
Emp. Form.C30H41N5O8
Mol. Mass.599.6752
SMILESCC(C)CNC(=O)[C@H](C)C[C@H](O)[C@H](CC(C)C)NC(=O)[C@H](Cc1ccc(cc1)[N+]([O-])=O)NC(=O)c1ccc(cc1)[N+]([O-])=O