Reaction Details
TargetAdenosine receptor A2a
LigandBDBM50316892
Substrate/Competitorn/a
Meas. Tech.ChEMBL_629845 (CHEMBL1116482)
Ki 0.9±n/a nM
Citation Shook, BCRassnick, SChakravarty, DWallace, NAult, MCrooke, JBarbay, JKWang, ALeonard, KPowell, MTAlford, VHall, DRupert, KCHeintzelman, GRHansen, KBullington, JLScannevin, RHCarroll, KLampron, LWestover, LRussell, RBranum, SWells, KDamon, SYouells, SBeauchamp, DLi, XRhodes, KJackson, PF Optimization of arylindenopyrimidines as potent adenosine A(2A)/A(1) antagonists. Bioorg Med Chem Lett20:2868-71 (2010) 
 
Adenosine receptor A2a
Name:Adenosine receptor A2a
Type:G Protein-Coupled Receptor (GPCR)
Mol. Mass.:44716.46
Organism:Homo sapiens (Human)
Description:P29274
Residue:412
BDBM50316892
NameBDBM50316892
Synonyms:2-amino-4-phenyl-8-(2-(pyridin-4-yl)ethylamino)-5H-indeno[1,2-d]pyrimidin-5-one | CHEMBL1098458
TypeSmall organic molecule
Emp. Form.C24H19N5O
Mol. Mass.393.4406
SMILESNc1nc2-c3cc(NCCc4ccncc4)ccc3C(=O)c2c(n1)-c1ccccc1