Reaction Details
TargetSodium-dependent serotonin transporter
LigandBDBM50316947
Substrate/Competitorn/a
Meas. Tech.ChEMBL_630104 (CHEMBL1110024)
Ki 1.7±n/a nM
Citation Yan, YZhou, PRotella, DPFeenstra, RKruse, CGReinders, JHvan der Neut, MLai, MZhang, JKowal, DMCarrick, TMarquis, KLPausch, MHRobichaud, AJ Potent dihydroquinolinone dopamine D2 partial agonist/serotonin reuptake inhibitors for the treatment of schizophrenia. Bioorg Med Chem Lett20:2983-6 (2010) 
 
Sodium-dependent serotonin transporter
Name:Sodium-dependent serotonin transporter
Type:Multi-pass membrane protein
Mol. Mass.:70322.51
Organism:Homo sapiens (Human)
Description:P31645
Residue:630
BDBM50316947
NameBDBM50316947
Synonyms:CHEMBL1087818 | N-(3-(2-(8-((2-oxo-1,2,3,4-tetrahydroquinolin-7-yl)methyl)-3-azabicyclo[3.2.1]octan-3-yl)ethoxy)phenyl)methanesulfonamide
TypeSmall organic molecule
Emp. Form.C26H33N3O4S
Mol. Mass.483.623
SMILESCS(=O)(=O)Nc1cccc(OCCN2CC3CCC(C2)C3Cc2ccc3CCC(=O)Nc3c2)c1