Reaction Details
TargetSodium-dependent serotonin transporter
LigandBDBM50316949
Substrate/Competitorn/a
Meas. Tech.ChEMBL_630104 (CHEMBL1110024)
Ki 0.26±n/a nM
Citation Yan, YZhou, PRotella, DPFeenstra, RKruse, CGReinders, JHvan der Neut, MLai, MZhang, JKowal, DMCarrick, TMarquis, KLPausch, MHRobichaud, AJ Potent dihydroquinolinone dopamine D2 partial agonist/serotonin reuptake inhibitors for the treatment of schizophrenia. Bioorg Med Chem Lett20:2983-6 (2010) 
 
Sodium-dependent serotonin transporter
Name:Sodium-dependent serotonin transporter
Type:Multi-pass membrane protein
Mol. Mass.:70322.51
Organism:Homo sapiens (Human)
Description:P31645
Residue:630
BDBM50316949
NameBDBM50316949
Synonyms:(3R)-3-((3-((2-oxo-1,2,3,4-tetrahydroquinolin-7-yl)methyl)-8-azabicyclo[3.2.1]octan-8-yl)methyl)-7,9-dihydro-2H-[1,4]dioxino[2,3-e]indol-8(3H)-one | CHEMBL1088000
TypeSmall organic molecule
Emp. Form.C28H31N3O4
Mol. Mass.473.5634
SMILESO=C1Cc2c(N1)ccc1O[C@H](CN3C4CCC3CC(Cc3ccc5CCC(=O)Nc5c3)C4)COc21