Reaction Details
TargetSodium-dependent serotonin transporter
LigandBDBM50316955
Substrate/Competitorn/a
Meas. Tech.ChEMBL_630104 (CHEMBL1110024)
Ki 1.9±n/a nM
Citation Yan, YZhou, PRotella, DPFeenstra, RKruse, CGReinders, JHvan der Neut, MLai, MZhang, JKowal, DMCarrick, TMarquis, KLPausch, MHRobichaud, AJ Potent dihydroquinolinone dopamine D2 partial agonist/serotonin reuptake inhibitors for the treatment of schizophrenia. Bioorg Med Chem Lett20:2983-6 (2010) 
 
Sodium-dependent serotonin transporter
Name:Sodium-dependent serotonin transporter
Type:Multi-pass membrane protein
Mol. Mass.:70322.51
Organism:Homo sapiens (Human)
Description:P31645
Residue:630
BDBM50316955
NameBDBM50316955
Synonyms:(R)-3-((4-((2-oxo-1,2,3,4-tetrahydroquinolin-7-yl)methyl)piperidin-1-yl)methyl)-7,9-dihydro-2H-[1,4]dioxino[2,3-e]indol-8(3H)-one | CHEMBL1087455
TypeSmall organic molecule
Emp. Form.C26H29N3O4
Mol. Mass.447.5262
SMILESO=C1Cc2c(N1)ccc1O[C@H](CN3CCC(Cc4ccc5CCC(=O)Nc5c4)CC3)COc21