Reaction Details
Target5-hydroxytryptamine receptor 1A
LigandBDBM50316964
Substrate/Competitorn/a
Meas. Tech.ChEMBL_630116 (CHEMBL1113707)
Ki 0.038±n/a nM
Citation Fiorino, FSeverino, BDe Angelis, FPerissutti, EMagli, EFrecentese, FEsposito, AMassarelli, PNencini, CSantagada, VCaliendo, G New 5-HT(1A) receptor ligands containing a N'-cyanoisonicotinamidine nucleus: synthesis and in vitro pharmacological evaluation. Bioorg Med Chem Lett20:2978-82 (2010) 
 
5-hydroxytryptamine receptor 1A
Name:5-hydroxytryptamine receptor 1A
Type:G Protein-Coupled Receptor (GPCR)
Mol. Mass.:46445.29
Organism:Rattus norvegicus (rat)
Description:Binding assays were performed using rat hippocampal membranes.
Residue:422
BDBM50316964
NameBDBM50316964
Synonyms:CHEMBL1086961 | N'-cyano-N-(3-(4-(pyridin-2-yl)piperazin-1-yl)propyl)isonicotinamidine
TypeSmall organic molecule
Emp. Form.C19H23N7
Mol. Mass.349.4328
SMILESN#CNC(=NCCCN1CCN(CC1)c1ccccn1)c1ccncc1