Reaction Details
TargetAdenosine receptor A2a
LigandBDBM50316996
Substrate/Competitorn/a
Meas. Tech.ChEMBL_630130 (CHEMBL1113721)
Ki 5.4±n/a nM
Citation Shook, BCRassnick, SHall, DRupert, KCHeintzelman, GRHansen, KChakravarty, DBullington, JLScannevin, RHMagliaro, BWestover, LCarroll, KLampron, LRussell, RBranum, SWells, KDamon, SYouells, SLi, XOsbourne, MDemarest, KTang, YRhodes, KJackson, PF Methylene amine substituted arylindenopyrimidines as potent adenosine A(2A)/A(1) antagonists. Bioorg Med Chem Lett20:2864-7 (2010) 
 
Adenosine receptor A2a
Name:Adenosine receptor A2a
Type:G Protein-Coupled Receptor (GPCR)
Mol. Mass.:44716.46
Organism:Homo sapiens (Human)
Description:P29274
Residue:412
BDBM50316996
NameBDBM50316996
Synonyms:2-amino-4-phenyl-8-((pyridin-2-ylmethylamino)methyl)-5H-indeno[1,2-d]pyrimidin-5-one | CHEMBL1088235
TypeSmall organic molecule
Emp. Form.C24H19N5O
Mol. Mass.393.4406
SMILESNc1nc2-c3cc(CNCc4ccccn4)ccc3C(=O)c2c(n1)-c1ccccc1