Reaction Details
TargetBeta-secretase 1
LigandBDBM50317028
Substrate/Competitorn/a
Meas. Tech.ChEMBL_630324 (CHEMBL1109071)
Ki 60±n/a nM
Citation Cumming, JBabu, SHuang, YCarrol, CChen, XFavreau, LGreenlee, WGuo, TKennedy, MKuvelkar, RLe, TLi, GMcHugh, NOrth, POzgur, LParker, ESaionz, KStamford, AStrickland, CTadesse, DVoigt, JZhang, LZhang, Q Piperazine sulfonamide BACE1 inhibitors: design, synthesis, and in vivo characterization. Bioorg Med Chem Lett20:2837-42 (2010) 
 
Beta-secretase 1
Name:Beta-secretase 1
Type:Protein
Mol. Mass.:55755.10
Organism:Homo sapiens (Human)
Description:P56817
Residue:501
BDBM50317028
NameBDBM50317028
Synonyms:CHEMBL1097322 | N1-((1S,2S)-3-(3,5-difluorophenyl)-1-hydroxy-1-((R)-4-tosylpiperazin-2-yl)propan-2-yl)-5-methyl-N3,N3-dipropylisophthalamide
TypeSmall organic molecule
Emp. Form.C35H44F2N4O5S
Mol. Mass.670.809
SMILESCCCN(CCC)C(=O)c1cc(C)cc(c1)C(=O)N[C@@H](Cc1cc(F)cc(F)c1)[C@H](O)[C@H]1CN(CCN1)S(=O)(=O)c1ccc(C)cc1