Reaction Details
TargetBeta-secretase 1
LigandBDBM50317052
Substrate/Competitorn/a
Meas. Tech.ChEMBL_630343 (CHEMBL1109090)
IC50 38±n/a nM
Citation Cumming, JBabu, SHuang, YCarrol, CChen, XFavreau, LGreenlee, WGuo, TKennedy, MKuvelkar, RLe, TLi, GMcHugh, NOrth, POzgur, LParker, ESaionz, KStamford, AStrickland, CTadesse, DVoigt, JZhang, LZhang, Q Piperazine sulfonamide BACE1 inhibitors: design, synthesis, and in vivo characterization. Bioorg Med Chem Lett20:2837-42 (2010) 
 
Beta-secretase 1
Name:Beta-secretase 1
Type:Protein
Mol. Mass.:55755.10
Organism:Homo sapiens (Human)
Description:P56817
Residue:501
BDBM50317052
NameBDBM50317052
Synonyms:CHEMBL1097346 | N-((1S,2S)-3-(3,5-difluorophenyl)-1-hydroxy-1-((R)-4-(m-tolylsulfonyl)piperazin-2-yl)propan-2-yl)-3-(ethylamino)-5-(N-methylmethylsulfonamido)benzamide
TypeSmall organic molecule
Emp. Form.C31H39F2N5O6S2
Mol. Mass.679.798
SMILESCCNc1cc(cc(c1)C(=O)N[C@@H](Cc1cc(F)cc(F)c1)[C@H](O)[C@H]1CN(CCN1)S(=O)(=O)c1cccc(C)c1)N(C)S(C)(=O)=O