Reaction Details
TargetBeta-secretase 1
LigandBDBM50317049
Substrate/Competitorn/a
Meas. Tech.ChEMBL_630324 (CHEMBL1109071)
Ki 3±n/a nM
Citation Cumming, JBabu, SHuang, YCarrol, CChen, XFavreau, LGreenlee, WGuo, TKennedy, MKuvelkar, RLe, TLi, GMcHugh, NOrth, POzgur, LParker, ESaionz, KStamford, AStrickland, CTadesse, DVoigt, JZhang, LZhang, Q Piperazine sulfonamide BACE1 inhibitors: design, synthesis, and in vivo characterization. Bioorg Med Chem Lett20:2837-42 (2010) 
 
Beta-secretase 1
Name:Beta-secretase 1
Type:Protein
Mol. Mass.:55755.10
Organism:Homo sapiens (Human)
Description:P56817
Residue:501
BDBM50317049
NameBDBM50317049
Synonyms:CHEMBL1097343 | N-((1S,2S)-3-(3,5-difluorophenyl)-1-hydroxy-1-((R)-4-(m-tolylsulfonyl)piperazin-2-yl)propan-2-yl)-5-((R)-2-(methoxymethyl)pyrrolidin-1-yl)-5-oxopentanamide
TypeSmall organic molecule
Emp. Form.C31H42F2N4O6S
Mol. Mass.636.75
SMILESCOC[C@H]1CCCN1C(=O)CCCC(=O)N[C@@H](Cc1cc(F)cc(F)c1)[C@H](O)[C@H]1CN(CCN1)S(=O)(=O)c1cccc(C)c1