Reaction Details
TargetRibosyldihydronicotinamide dehydrogenase [quinone]
LigandBDBM50317140
Substrate/Competitorn/a
Meas. Tech.ChEMBL_630842 (CHEMBL1109212)
IC50 6±n/a nM
Citation Nolan, KAHumphries, MPBryce, RAStratford, IJ Imidazoacridin-6-ones as novel inhibitors of the quinone oxidoreductase NQO2. Bioorg Med Chem Lett20:2832-6 (2010) 
 
Ribosyldihydronicotinamide dehydrogenase [quinone]
Name:Ribosyldihydronicotinamide dehydrogenase [quinone]
Type:Protein
Mol. Mass.:25917.25
Organism:Homo sapiens (Human)
Description:P16083
Residue:231
BDBM50317140
NameBDBM50317140
Synonyms:5-(2-(diethylamino)ethylamino)-7-hydroxy-8,9-dimethoxy-6H-imidazo[4,5,1-de]acridin-6-one CHEMBL8602 | NSC-660841
TypeSmall organic molecule
Emp. Form.C22H26N4O4
Mol. Mass.410.4662
SMILESCCN(CC)CCNc1ccc2ncn3c2c1c(=O)c1c(O)c(OC)c(OC)cc31