Reaction Details
TargetRibosyldihydronicotinamide dehydrogenase [quinone]
LigandBDBM50317138
Substrate/Competitorn/a
Meas. Tech.ChEMBL_630842 (CHEMBL1109212)
IC50 17±n/a nM
Citation Nolan, KAHumphries, MPBryce, RAStratford, IJ Imidazoacridin-6-ones as novel inhibitors of the quinone oxidoreductase NQO2. Bioorg Med Chem Lett20:2832-6 (2010) 
 
Ribosyldihydronicotinamide dehydrogenase [quinone]
Name:Ribosyldihydronicotinamide dehydrogenase [quinone]
Type:Protein
Mol. Mass.:25917.25
Organism:Homo sapiens (Human)
Description:P16083
Residue:231
BDBM50317138
NameBDBM50317138
Synonyms:5-(2-(diethylamino)ethylamino)-7,10-dimethoxy-6H-imidazo[4,5,1-de]acridin-6-one CHEMBL8150 | NSC-660839
TypeSmall organic molecule
Emp. Form.C22H26N4O3
Mol. Mass.394.4668
SMILESCCN(CC)CCNc1ccc2ncn3c2c1c(=O)c1c(OC)ccc(OC)c31