Reaction Details
TargetCyclin-dependent kinase/G2/mitotic-specific cyclin- 1
LigandBDBM50317161
Substrate/Competitorn/a
Meas. Tech.ChEMBL_631114 (CHEMBL1103823)
IC50 13±n/a nM
Citation Choi, SJLee, JEJeong, SYIm, ILee, SDLee, EJLee, SKKwon, SMAhn, SGYoon, JHHan, SYKim, JIKim, YC 5,5'-substituted indirubin-3'-oxime derivatives as potent cyclin-dependent kinase inhibitors with anticancer activity. J Med Chem53:3696-706 (2010) 
 
Cyclin-dependent kinase/G2/mitotic-specific cyclin- 1
Name:Cyclin-dependent kinase/G2/mitotic-specific cyclin- 1
Type:Protein Complex
Mol. Mass.:n/a
Description:CDK1/Cyclin B complexes were purified from insect cells co-infected with baculovirus vectors containing each of the components.
Components:This complex has 2 components.
Component 1
Name:Cyclin-dependent kinase 1
Synonyms:CDC2 CDK1 CDKN1 Cell division protein kinase 1 P34CDC2 | p34 protein kinase
Type:Enzyme Subunit
Mol. Mass.:34101.08
Organism:Homo sapiens (Human)
Description:P06493
Residue:297
Component 2
Name:G2/mitotic-specific cyclin-B1
Synonyms:CCNB CCNB1_HUMAN
Type:Enzyme Subunit
Mol. Mass.:48340.95
Organism:Homo sapiens (Human)
Description:P14635
Residue:433
BDBM50317161
NameBDBM50317161
Synonyms:(2'Z,3'E)-5-Nitro-5'-hydroxy-indirubin-3'-oxime | CHEMBL1088704
TypeSmall organic molecule
Emp. Form.C16H10N4O5
Mol. Mass.338.2744
SMILESOc1ccc2[nH]c(c(N=[OH+])c2c1)-[c-]1c2cc(ccc2[nH]c1=O)[N+]([O-])=O