Reaction Details
TargetHigh affinity nerve growth factor receptor
LigandBDBM50317161
Substrate/Competitorn/a
Meas. Tech.ChEMBL_631120 (CHEMBL1106492)
IC50 4000±n/a nM
Citation Choi, SJLee, JEJeong, SYIm, ILee, SDLee, EJLee, SKKwon, SMAhn, SGYoon, JHHan, SYKim, JIKim, YC 5,5'-substituted indirubin-3'-oxime derivatives as potent cyclin-dependent kinase inhibitors with anticancer activity. J Med Chem53:3696-706 (2010) 
 
High affinity nerve growth factor receptor
Name:High affinity nerve growth factor receptor
Type:n/a
Mol. Mass.:87498.18
Organism:Homo sapiens (Human)
Description:P04629
Residue:796
BDBM50317161
NameBDBM50317161
Synonyms:(2'Z,3'E)-5-Nitro-5'-hydroxy-indirubin-3'-oxime | CHEMBL1088704
TypeSmall organic molecule
Emp. Form.C16H10N4O5
Mol. Mass.338.2744
SMILESOc1ccc2[nH]c(c(N=[OH+])c2c1)-[c-]1c2cc(ccc2[nH]c1=O)[N+]([O-])=O