Reaction Details
TargetGlutamate receptor ionotropic, NMDA 1/2B
LigandBDBM50317185
Substrate/Competitorn/a
Meas. Tech.ChEMBL_631318 (CHEMBL1105655)
IC50 17800±n/a nM
Citation Rook, YSchmidtke, KUGaube, FSchepmann, DWünsch, BHeilmann, JLehmann, JWinckler, T Bivalent beta-carbolines as potential multitarget anti-Alzheimer agents. J Med Chem53:3611-7 (2010) 
 
Glutamate receptor ionotropic, NMDA 1/2B
Name:Glutamate receptor ionotropic, NMDA 1/2B
Type:Enzyme
Mol. Mass.:n/a
Description:n/a
Components:This complex has 2 components.
Component 1
Name:Glutamate receptor ionotropic, NMDA 1
Synonyms:GRIN1 Glutamate [NMDA] receptor subunit zeta-1 N-methyl-D-aspartate receptor subunit NR1 NMDZ1_HUMAN | phencyclidine
Type:Enzyme Catalytic Domain
Mol. Mass.:105397.81
Organism:Homo sapiens (Human)
Description:Q05586
Residue:938
Component 2
Name:Glutamate receptor ionotropic, NMDA 2B
Synonyms:GRIN2B Glutamate [NMDA] receptor subunit epsilon 2 N-methyl D-aspartate receptor subtype 2B NMDAR2B NR3 | hNR3
Type:PROTEIN
Mol. Mass.:166375.46
Organism:Homo sapiens (Human)
Description:ChEMBL_1438829
Residue:1484
BDBM50317185
NameBDBM50317185
Synonyms:2-[7-(beta-Carboline-2-ium-2-yl)heptyl]-beta-carboline-2-ium dibromide | CHEMBL1088722
TypeSmall organic molecule
Emp. Form.C29H30N4
Mol. Mass.434.5742
SMILESC(CCC[n+]1ccc2c(c1)[nH]c1ccccc21)CCC[n+]1ccc2c(c1)[nH]c1ccccc21