Reaction Details
TargetGlutamate receptor ionotropic, NMDA 1/2A
LigandBDBM50317188
Substrate/Competitorn/a
Meas. Tech.ChEMBL_631316 (CHEMBL1105653)
IC50 13500±n/a nM
Citation Rook, YSchmidtke, KUGaube, FSchepmann, DWünsch, BHeilmann, JLehmann, JWinckler, T Bivalent beta-carbolines as potential multitarget anti-Alzheimer agents. J Med Chem53:3611-7 (2010) 
 
Glutamate receptor ionotropic, NMDA 1/2A
Name:Glutamate receptor ionotropic, NMDA 1/2A
Type:Protein
Mol. Mass.:n/a
Description:n/a
Components:This complex has 2 components.
Component 1
Name:Glutamate receptor ionotropic, NMDA 1
Synonyms:GRIN1 Glutamate [NMDA] receptor subunit zeta-1 N-methyl-D-aspartate receptor subunit NR1 NMDZ1_HUMAN | phencyclidine
Type:Enzyme Catalytic Domain
Mol. Mass.:105397.81
Organism:Homo sapiens (Human)
Description:Q05586
Residue:938
Component 2
Name:Glutamate receptor ionotropic, NMDA 2A
Synonyms:GRIN2A Glutamate [NMDA] receptor Glutamate [NMDA] receptor subunit epsilon-1 NMDA receptor subtype 2A protein (NR2A) NMDE1_HUMAN hNR2A
Type:n/a
Mol. Mass.:165293.76
Organism:Homo sapiens (Human)
Description:n/a
Residue:1464
BDBM50317188
NameBDBM50317188
Synonyms:2-[9-(beta-Carboline-2-ium-2-yl)nonyl]-beta-carboline-2-ium dibromide | CHEMBL1088655
TypeSmall organic molecule
Emp. Form.C31H34N4
Mol. Mass.462.6274
SMILESC(CCCC[n+]1ccc2c(c1)[nH]c1ccccc21)CCCC[n+]1ccc2c(c1)[nH]c1ccccc21