Reaction Details
TargetCholinesterase
LigandBDBM50317188
Substrate/Competitorn/a
Meas. Tech.ChEMBL_631312 (CHEMBL1105649)
IC50 41±n/a nM
Citation Rook, YSchmidtke, KUGaube, FSchepmann, DWünsch, BHeilmann, JLehmann, JWinckler, T Bivalent beta-carbolines as potential multitarget anti-Alzheimer agents. J Med Chem53:3611-7 (2010) 
 
Cholinesterase
Name:Cholinesterase
Type:Enzyme
Mol. Mass.:65643.35
Organism:Equus caballus (Horse)
Description:P81908
Residue:574
BDBM50317188
NameBDBM50317188
Synonyms:2-[9-(beta-Carboline-2-ium-2-yl)nonyl]-beta-carboline-2-ium dibromide | CHEMBL1088655
TypeSmall organic molecule
Emp. Form.C31H34N4
Mol. Mass.462.6274
SMILESC(CCCC[n+]1ccc2c(c1)[nH]c1ccccc21)CCCC[n+]1ccc2c(c1)[nH]c1ccccc21