Reaction Details
TargetCholinesterase
LigandBDBM50317184
Substrate/Competitorn/a
Meas. Tech.ChEMBL_631312 (CHEMBL1105649)
IC50 49±n/a nM
Citation Rook, YSchmidtke, KUGaube, FSchepmann, DWünsch, BHeilmann, JLehmann, JWinckler, T Bivalent beta-carbolines as potential multitarget anti-Alzheimer agents. J Med Chem53:3611-7 (2010) 
 
Cholinesterase
Name:Cholinesterase
Type:Enzyme
Mol. Mass.:65643.35
Organism:Equus caballus (Horse)
Description:P81908
Residue:574
BDBM50317184
NameBDBM50317184
Synonyms:2-[10-(beta-Carboline-2-ium-2-yl)decyl]-beta-carboline-2-ium dibromide | CHEMBL1088656
TypeSmall organic molecule
Emp. Form.C32H36N4
Mol. Mass.476.6539
SMILESC(CCCCC[n+]1ccc2c(c1)[nH]c1ccccc21)CCCC[n+]1ccc2c(c1)[nH]c1ccccc21