Reaction Details
TargetAcetylcholinesterase
LigandBDBM50317184
Substrate/Competitorn/a
Meas. Tech.ChEMBL_631311 (CHEMBL1103849)
IC50 63±n/a nM
Citation Rook, YSchmidtke, KUGaube, FSchepmann, DWünsch, BHeilmann, JLehmann, JWinckler, T Bivalent beta-carbolines as potential multitarget anti-Alzheimer agents. J Med Chem53:3611-7 (2010) 
 
Acetylcholinesterase
Name:Acetylcholinesterase
Type:Enzyme
Mol. Mass.:71812.79
Organism:Electrophorus electricus (Electric eel)
Description:n/a
Residue:633
BDBM50317184
NameBDBM50317184
Synonyms:2-[10-(beta-Carboline-2-ium-2-yl)decyl]-beta-carboline-2-ium dibromide | CHEMBL1088656
TypeSmall organic molecule
Emp. Form.C32H36N4
Mol. Mass.476.6539
SMILESC(CCCCC[n+]1ccc2c(c1)[nH]c1ccccc21)CCCC[n+]1ccc2c(c1)[nH]c1ccccc21