Reaction Details
TargetAcetylcholinesterase
LigandBDBM50317195
Substrate/Competitorn/a
Meas. Tech.ChEMBL_631311 (CHEMBL1103849)
IC50 147±n/a nM
Citation Rook, YSchmidtke, KUGaube, FSchepmann, DWünsch, BHeilmann, JLehmann, JWinckler, T Bivalent beta-carbolines as potential multitarget anti-Alzheimer agents. J Med Chem53:3611-7 (2010) 
 
Acetylcholinesterase
Name:Acetylcholinesterase
Type:Enzyme
Mol. Mass.:71812.79
Organism:Electrophorus electricus (Electric eel)
Description:n/a
Residue:633
BDBM50317195
NameBDBM50317195
Synonyms:2-[4-(beta-Carboline-2-ium-2-ylmethyl)benzyl]-beta-carboline-2-ium dibromide | CHEMBL1094553
TypeSmall organic molecule
Emp. Form.C30H24N4
Mol. Mass.440.5373
SMILESC(c1ccc(C[n+]2ccc3c(c2)[nH]c2ccccc32)cc1)[n+]1ccc2c(c1)[nH]c1ccccc21