Reaction Details
TargetCholinesterase
LigandBDBM50317180
Substrate/Competitorn/a
Meas. Tech.ChEMBL_631312 (CHEMBL1105649)
IC50 186±n/a nM
Citation Rook, YSchmidtke, KUGaube, FSchepmann, DWünsch, BHeilmann, JLehmann, JWinckler, T Bivalent beta-carbolines as potential multitarget anti-Alzheimer agents. J Med Chem53:3611-7 (2010) 
 
Cholinesterase
Name:Cholinesterase
Type:Enzyme
Mol. Mass.:65643.35
Organism:Equus caballus (Horse)
Description:P81908
Residue:574
BDBM50317180
NameBDBM50317180
Synonyms:2-[6-(beta-Carboline-2-ium-2-yl)hexyl]-beta-carboline-2-ium dibromide | CHEMBL1088355
TypeSmall organic molecule
Emp. Form.C28H28N4
Mol. Mass.420.5476
SMILESC(CCC[n+]1ccc2c(c1)[nH]c1ccccc21)CC[n+]1ccc2c(c1)[nH]c1ccccc21