Reaction Details
TargetCholinesterase
LigandBDBM50317191
Substrate/Competitorn/a
Meas. Tech.ChEMBL_631312 (CHEMBL1105649)
IC50 195±n/a nM
Citation Rook, YSchmidtke, KUGaube, FSchepmann, DWünsch, BHeilmann, JLehmann, JWinckler, T Bivalent beta-carbolines as potential multitarget anti-Alzheimer agents. J Med Chem53:3611-7 (2010) 
 
Cholinesterase
Name:Cholinesterase
Type:Enzyme
Mol. Mass.:65643.35
Organism:Equus caballus (Horse)
Description:P81908
Residue:574
BDBM50317191
NameBDBM50317191
Synonyms:2-[2-(2-{2-[2-(beta-Carboline-2-ium-2-yl)ethoxy]ethoxy}ethoxy)ethyl]-beta-carboline-2-ium dibromide | CHEMBL1088378
TypeSmall organic molecule
Emp. Form.C30H32N4O3
Mol. Mass.496.599
SMILESC(COCC[n+]1ccc2c(c1)[nH]c1ccccc21)OCCOCC[n+]1ccc2c(c1)[nH]c1ccccc21