Reaction Details
TargetAcetylcholinesterase
LigandBDBM50317194
Substrate/Competitorn/a
Meas. Tech.ChEMBL_631311 (CHEMBL1103849)
IC50 278±n/a nM
Citation Rook, YSchmidtke, KUGaube, FSchepmann, DWünsch, BHeilmann, JLehmann, JWinckler, T Bivalent beta-carbolines as potential multitarget anti-Alzheimer agents. J Med Chem53:3611-7 (2010) 
 
Acetylcholinesterase
Name:Acetylcholinesterase
Type:Enzyme
Mol. Mass.:71812.79
Organism:Electrophorus electricus (Electric eel)
Description:n/a
Residue:633
BDBM50317194
NameBDBM50317194
Synonyms:2-[4-(beta-Carboline-2-ium-2-yl)butyl]-beta-carboline-2-ium dibromide | CHEMBL1088353
TypeSmall organic molecule
Emp. Form.C26H24N4
Mol. Mass.392.4945
SMILESC(CC[n+]1ccc2c(c1)[nH]c1ccccc21)C[n+]1ccc2c(c1)[nH]c1ccccc21