Reaction Details
TargetAcetylcholinesterase
LigandBDBM50317192
Substrate/Competitorn/a
Meas. Tech.ChEMBL_631311 (CHEMBL1103849)
IC50 280±n/a nM
Citation Rook, YSchmidtke, KUGaube, FSchepmann, DWünsch, BHeilmann, JLehmann, JWinckler, T Bivalent beta-carbolines as potential multitarget anti-Alzheimer agents. J Med Chem53:3611-7 (2010) 
 
Acetylcholinesterase
Name:Acetylcholinesterase
Type:Enzyme
Mol. Mass.:71812.79
Organism:Electrophorus electricus (Electric eel)
Description:n/a
Residue:633
BDBM50317192
NameBDBM50317192
Synonyms:2-Methyl-9-[5-(2-methyl-beta-carboline-9-yl)pentyl]-beta-carboline-2-ium diiodide | CHEMBL1095784
TypeSmall organic molecule
Emp. Form.C29H30N4
Mol. Mass.434.5742
SMILESC[n+]1ccc2c(c1)n(CCCCCn1c3ccccc3c3cc[n+](C)cc13)c1ccccc21